18 Replies Latest reply on Mar 14, 2014 12:33 PM by chetanmahendru

    Failed to execute goal on project jive-local-services

    chetanmahendru

      Hi Ryan King,

       

      I am getting the following error when I am trying to start the EAE services

       

      M-CMAHENDR-01:run-services cmahendr$ ./eae-start

      readlink: illegal option -- f

      usage: readlink [-n] [file ...]

      Warning: JAVA_HOME environment variable is not set.

      [INFO] Scanning for projects...

      [INFO]                                                                       

      [INFO] ------------------------------------------------------------------------

      [INFO] Building Jive Local Services 6.0.x

      [INFO] ------------------------------------------------------------------------

      Downloading: https://maven-secure.jivesoftware.com/archiva/repository/jive.snapshots/eae/shared/eae-constants/3.0.0.0-SNAPSHOT/maven-metadata.xml

      [WARNING] Could not transfer metadata eae.shared:eae-constants:3.0.0.0-SNAPSHOT/maven-metadata.xml from/to jive.snapshots (https://maven-secure.jivesoftware.com/archiva/repository/jive.snapshots): Not authorized , ReasonPhrase:Unauthorized.

      [WARNING] Failure to transfer eae.shared:eae-constants:3.0.0.0-SNAPSHOT/maven-metadata.xml from https://maven-secure.jivesoftware.com/archiva/repository/jive.snapshots was cached in the local repository, resolution will not be reattempted until the update interval of jive.snapshots has elapsed or updates are forced. Original error: Could not transfer metadata eae.shared:eae-constants:3.0.0.0-SNAPSHOT/maven-metadata.xml from/to jive.snapshots (https://maven-secure.jivesoftware.com/archiva/repository/jive.snapshots): Not authorized , ReasonPhrase:Unauthorized.

      Downloading: https://maven-secure.jivesoftware.com/archiva/repository/jive.snapshots/eae/shared/eae-constants/3.0.0.0-SNAPSHOT/eae-constants-3.0.0.0-20120117.074306-26.pom

      [INFO] ------------------------------------------------------------------------

      [INFO] BUILD FAILURE

      [INFO] ------------------------------------------------------------------------

      [INFO] Total time: 5.514s

      [INFO] Finished at: Tue Feb 18 18:06:34 PST 2014

      [INFO] Final Memory: 8M/19M

      [INFO] ------------------------------------------------------------------------

      [ERROR] Failed to execute goal on project jive-local-services: Could not resolve dependencies for project com.jivesoftware.testcustomer:jive-local-services:pom:6.0.x: Failed to collect dependencies at eae.core:eae-service:jar:shaded:3.2.3.8 -> com.jivesoftware.service.streams.query.service-impl:embedded-lucene-streams-query-service:jar:1.2.3.1 -> com.jivesoftware.service.common:marshall:jar:1.3.0.1 -> eae.shared:eae-constants:jar:3.0.0.0-SNAPSHOT: Failed to read artifact descriptor for eae.shared:eae-constants:jar:3.0.0.0-SNAPSHOT: Could not transfer artifact eae.shared:eae-constants:pom:3.0.0.0-20120117.074306-26 from/to jive.snapshots (https://maven-secure.jivesoftware.com/archiva/repository/jive.snapshots): Not authorized , ReasonPhrase:Unauthorized. -> [Help 1]

      [ERROR]

      [ERROR] To see the full stack trace of the errors, re-run Maven with the -e switch.

      [ERROR] Re-run Maven using the -X switch to enable full debug logging.

      [ERROR]

      [ERROR] For more information about the errors and possible solutions, please read the following articles:

      [ERROR] [Help 1] http://cwiki.apache.org/confluence/display/MAVEN/DependencyResolutionException

       

      Can you let me know what needs to be done to fix this. As you had mentioned earlier, I tried to access Apache Archiva \ Quick Search and it was working fine for me. I used the credentials present in settings.xml file.

       

      Regards

      Chetan Mahendru

       

      Tagging Amit Rajesth,