2 Replies Latest reply on Sep 8, 2015 5:44 AM by surabhimishra

    Jive 8 local setup issue

    surabhimishra

      Hi All-

       

      Im getting following error trace when I try to run mvn -U jive:create-project to install Jive 8:

       

      [WARNING] Failure to transfer com.jivesoftware.maven.plugins/maven-metadata.xml

      from https://maven-secure.jivesoftware.com/archiva/repository/jive.snapshots was

      cached in the local repository, resolution will not be reattempted until the up

      date interval of jive.snapshots has elapsed or updates are forced. Original erro

      r: Could not transfer metadata com.jivesoftware.maven.plugins/maven-metadata.xml

      from/to jive.snapshots (https://maven-secure.jivesoftware.com/archiva/repositor

      y/jive.snapshots): sun.security.validator.ValidatorException: PKIX path building

      failed: sun.security.provider.certpath.SunCertPathBuilderException: unable to f

      ind valid certification path to requested target

      [WARNING] Failure to transfer org.apache.maven.plugins/maven-metadata.xml from h

      ttps://maven-secure.jivesoftware.com/archiva/repository/jive.internal was cached

      in the local repository, resolution will not be reattempted until the update in

      terval of jive.internal has elapsed or updates are forced. Original error: Could

      not transfer metadata org.apache.maven.plugins/maven-metadata.xml from/to jive.

      internal (https://maven-secure.jivesoftware.com/archiva/repository/jive.internal

      ): sun.security.validator.ValidatorException: PKIX path building failed: sun.sec

      urity.provider.certpath.SunCertPathBuilderException: unable to find valid certif

      ication path to requested target

      [WARNING] Failure to transfer org.apache.maven.plugins/maven-metadata.xml from h

      ttps://maven-secure.jivesoftware.com/archiva/repository/jive.snapshots was cache

      d in the local repository, resolution will not be reattempted until the update i

      nterval of jive.snapshots has elapsed or updates are forced. Original error: Cou

      ld not transfer metadata org.apache.maven.plugins/maven-metadata.xml from/to jiv

      e.snapshots (https://maven-secure.jivesoftware.com/archiva/repository/jive.snaps

      hots): sun.security.validator.ValidatorException: PKIX path building failed: sun

      .security.provider.certpath.SunCertPathBuilderException: unable to find valid ce

      rtification path to requested target

      [WARNING] Failure to transfer org.codehaus.mojo/maven-metadata.xml from https://

      maven-secure.jivesoftware.com/archiva/repository/jive.internal was cached in the

      local repository, resolution will not be reattempted until the update interval

      of jive.internal has elapsed or updates are forced. Original error: Could not tr

      ansfer metadata org.codehaus.mojo/maven-metadata.xml from/to jive.internal (http

      s://maven-secure.jivesoftware.com/archiva/repository/jive.internal): sun.securit

      y.validator.ValidatorException: PKIX path building failed: sun.security.provider

      .certpath.SunCertPathBuilderException: unable to find valid certification path t

      o requested target

      [WARNING] Failure to transfer org.codehaus.mojo/maven-metadata.xml from https://

      maven-secure.jivesoftware.com/archiva/repository/jive.snapshots was cached in th

      e local repository, resolution will not be reattempted until the update interval

      of jive.snapshots has elapsed or updates are forced. Original error: Could not

      transfer metadata org.codehaus.mojo/maven-metadata.xml from/to jive.snapshots (h

      ttps://maven-secure.jivesoftware.com/archiva/repository/jive.snapshots): sun.sec

      urity.validator.ValidatorException: PKIX path building failed: sun.security.prov

      ider.certpath.SunCertPathBuilderException: unable to find valid certification pa

      th to requested target

      [INFO] ------------------------------------------------------------------------

      [INFO] BUILD FAILURE

      [INFO] ------------------------------------------------------------------------

      [INFO] Total time: 3.857 s

      [INFO] Finished at: 2015-09-04T17:18:35+05:30

      [INFO] Final Memory: 12M/150M

      [INFO] ------------------------------------------------------------------------

      [ERROR] No plugin found for prefix 'jive' in the current project and in the plug

      in groups [com.jivesoftware.maven.plugins, org.apache.maven.plugins, org.codehau

      s.mojo] available from the repositories [local (C:\Jive8Installs\Maven8Repo), ji

      ve.internal (https://maven-secure.jivesoftware.com/archiva/repository/jive.inter

      nal), jive.snapshots (https://maven-secure.jivesoftware.com/archiva/repository/j

      ive.snapshots), central (https://repo.maven.apache.org/maven2)] -> [Help 1]

      [ERROR]

      [ERROR] To see the full stack trace of the errors, re-run Maven with the -e swit

      ch.

      [ERROR] Re-run Maven using the -X switch to enable full debug logging.

      [ERROR]

      [ERROR] For more information about the errors and possible solutions, please rea

      d the following articles:

      [ERROR] [Help 1] http://cwiki.apache.org/confluence/display/MAVEN/NoPluginFoundF

      orPrefixException

       

      Please let me know if anyone has any idea of these errors.

      Thank you!